{"text_format":"1","workbook":"xlsx","n_sheets":9,"sheets":["Instructions","Data Entry","Summary","Data Table","Monthly Expenses","Yearly and Infrequent Expenses","FX Rates","Reference","Temp"],"not_rendered":{"charts":1,"images":0,"macros":1,"external_links":0,"defined_names":45,"comments":0,"pivot_tables":0},"unopened":[],"bounds":{"document_bytes":16777216,"sheet_cells":100000,"rows_first":2000,"rows_last":500,"rows_between":2000,"halvings":0,"cell_chars":16384,"cell_head_chars":4096},"cells_cut":0,"cells_raw":0,"read":"whole","date_system":"1900"}

{"sheet":"Instructions","index":0,"n_rows":19,"n_cols":3,"rows_kept":19,"cut":false,"hidden":false,"merged":[]}
[]
[null,null,"ICSC Electronic Diary: Instructions"]
[]
[null,null,"Welcome to the ICSC Electronic Diary!\nThe electronic diary is an optional tool to help you track your montly household expenditures.\nWhile the primary purpose of this tool is to assist you in completing the ICSC Cost-of-Living Household Expenditure Survey, there are additional features which give you an overview of your expenditure patterns. Note that this is not the ICSC survey itself.\n\nNote: In the current version, foreign exchange conversions are done based on rates provided by the UN Treasury Office as of 15 September 2021 (https://treasury.un.org/operationalrates/OperationalRates.php)\n\nHOW TO USE:\nMacros MUST be enabled.\n\n1. To enter a new expense, either go to the \"Data Entry\" tab or click on \"Add New Expenditure\".\n2. On the \"Data Entry\" worksheet, fill in all required fields and click on \"Add New Expenditure\".\n3. To review or edit an expenditure record, click \"Review Expenditures\".\n4. To see values to be entered in the ICSC Cost-of-Living Survey, click on \"Monthly Expenses\" and \"Year and Infrequent Expenses\"."]
[]
[null,null,"Data Entry"]
[null,null,"You may record your expenses for the various items of the ICSC basket of goods and services. These expenditures can be entered by selecting the appropriate item category and subcategory, and specifying whether the purchases were made locally or outside the country of the duty station. The tool allows you to navigate to other dates for data entry. Note that all data entry fields are highlighted in yellow."]
[]
[null,null,"Summary"]
[null,null,"The home page serves as a visual summary of the expenses entered. All values displayed on the home page are in US Dollar (USD).\nYou can navigate to other features of this diary from the buttons on the lower left of the screen."]
[]
[null,null,"Data Table"]
[null,null,"You may refer to the Data Table to review and/or edit expenses recorded. Note, that the \"Clear Data Table\" button will clear all entries. To delete a single entry, you may select the row, right-click, and delete. You are encouraged to periodically save a copy of your expenditure history."]
[]
[null,null,"Monthly Expenses"]
{"$rows_left_out":5}
{"sheet":"Data Entry","index":1,"n_rows":14,"n_cols":4,"rows_kept":14,"cut":false,"hidden":false,"merged":[]}
[]
[null,"ICSC Electronic Diary: Data Entry"]
[]
[null,"COUNTRY OF DUTY STATION ","Afghanistan"]
[null,null,"Expenditure Date"]
[null,null,{"$f":"TODAY()","v":"2021-10-11"}]
[]
[null,"Item Category ",null,{"$f":"IF(OR(ISBLANK(NewExpenseCategory),ISERROR(MATCH(NewExpenseCategory,GroupList,0))),\"mandatory: select from dropdown list\",\"\")","v":"mandatory: select from dropdown list"}]
[null,"Item Subcategory ",null,{"$f":"IF(OR(ISBLANK(NewExpenseSubcategory),ISERROR(MATCH(NewExpenseSubcategory,INDIRECT(CONCATENATE(LEFT(NewExpenseCategory,3),\"List\")),0))),\"mandatory: select from dropdown list\",\"\")","v":"mandatory: select from dropdown list"}]
[null,"Description (optional) "," "]
[null,"Purchased Inside/Outside Duty Station? ","Inside"]
[null,"Amount ",null,"Use 1,234.56 number format"]
[null,"Currency ",{"$f":"IF(NewExpenseInsideOutside=\"Inside\", VLOOKUP(DSCountry, CurrencyTable, 3, FALSE), \"USD\")","v":"AFN"},{"$f":"IF(ISBLANK(NewExpenseCurrency),\"mandatory: select from dropdown list\",\"\")","v":""}]
[null,null,"Note: Foreign exchange conversions are based on rates published by the UN Treasury as of 15 September 2021."]

{"sheet":"Summary","index":2,"n_rows":32,"n_cols":5,"rows_kept":32,"cut":false,"hidden":false,"merged":[[4,2,4,4],[14,2,15,4]]}
[]
[null,"ICSC Electronic Diary: Home Page"]
[null,"COUNTRY OF DUTY STATION","Date"]
[null,{"$f":"DSCountry","v":"Afghanistan"},{"$f":"TODAY()","v":"2021-10-11"}]
[null,null,"The table and pie chart are based on all expenditures entered in this diary.\nForeign exchange conversions are based on rates published by the UN Treasury as of 15 September 2021."]
[null,"Today's Expenditures (USD)"]
[null,{"$f":"SUMIF('Data Table'!B:B,TODAY(),'Data Table'!J:J)","v":0},null,null," "]
[]
[null,{"$f":"CONCATENATE(\"Current Expenditures (USD) for \",VLOOKUP(MONTH(TODAY()),MonthNumberTable,2,FALSE), \" \", YEAR(TODAY()))","v":"Current Expenditures (USD) for October 2021"}]
[null,{"$f":"SUMIF('Data Table'!B:B,\">\"&(TODAY()-DAY(TODAY())),'Data Table'!J:J)","v":0},null,null," "]
[]
[null,"Daily Average (USD)"]
[null,{"$f":"SUM('Data Table'!J:J)/RecordSpan","v":0},null,null," "]
[]
[null,null,"EXPENDITURES IN US DOLLAR"]
{"$rows_left_out":18}
{"sheet":"Data Table","index":3,"n_rows":106,"n_cols":27,"rows_kept":106,"cut":false,"hidden":false,"merged":[[1,6,1,9],[1,1,1,5]]}
[]
[null,"ICSC Electronic Diary: Itemized List of All Expenditures",null,null,null,null,"Foreign exchange conversions are based on rates\npublished by the UN Treasury as of 30 June 2018."]
[null,"DATE","ITEM CATEGORY","ITEM SUBCATEGORY","ITEM DESCRIPTION","Inside/Outside\nDuty Station","AMOUNT","CURRENCY","TIME\nSPAN","AMOUNT\nin USD",null,null,null,null,null,null,null,null,null,null,null,null,null,null,null,null,"PieChart1Group"]
[]
[]
[]
[]
[]
[]
[]
[]
[]
[]
[]
[]
{"$rows_left_out":92}
{"sheet":"Monthly Expenses","index":4,"n_rows":42,"n_cols":9,"rows_kept":42,"cut":false,"hidden":false,"merged":[[0,1,0,8],[1,3,2,3],[3,1,41,1]]}
[null,{"$f":"IF(ProRateOrSum=1, \"NOTE: The accuracy of pro-rated estimates depends upon the time span covered by the recorded expenditures. See \"\"Instructions\"\" for more details.\",\"\")","v":""}]
[null,null,null,"ICSC Electronic Diary for\nMonthly Expenditures","INSIDE COUNTRY\nOF DUTY STATION",null,null,"OUTSIDE COUNTRY\nOF DUTY STATION"]
[null,null,null,null,"Amount\nin Local Currency","Amount Spent in Other Currency\n(Expressed in USD)",null,"Amount Spent\n(Expressed in USD)"]
[null,"MONTHLY","Food and Non-Alcoholic Beverages"]
[null,null,1,"Food purchased in supermarkets, stores, markets",{"$f":"SUMIFS('Data Table'!G:G,'Data Table'!D:D,'Monthly Expenses'!$D5,'Data Table'!F:F,\"Inside\",'Data Table'!H:H,LocalCurrencyCode)*(IF(ProRateOrSum=1,MonthlyMultiplier,1))","v":0},{"$f":"SUMIFS('Data Table'!J:J,'Data Table'!D:D,'Monthly Expenses'!$D5,'Data Table'!F:F,\"Inside\",'Data Table'!H:H,\"<>\"&LocalCurrencyCode)*(IF(ProRateOrSum=1,MonthlyMultiplier,1))","v":0},"USD",{"$f":"SUMIFS('Data Table'!J:J,'Data Table'!D:D,'Monthly Expenses'!$D5,'Data Table'!F:F,\"Outside\")*(IF(ProRateOrSum=1,MonthlyMultiplier,1))","v":0},"USD"]
[null,null,2,"Non-alcoholic beverages",{"$f":"SUMIFS('Data Table'!G:G,'Data Table'!D:D,'Monthly Expenses'!$D6,'Data Table'!F:F,\"Inside\",'Data Table'!H:H,LocalCurrencyCode)*(IF(ProRateOrSum=1,MonthlyMultiplier,1))","v":0},{"$f":"SUMIFS('Data Table'!J:J,'Data Table'!D:D,'Monthly Expenses'!$D6,'Data Table'!F:F,\"Inside\",'Data Table'!H:H,\"<>\"&LocalCurrencyCode)*(IF(ProRateOrSum=1,MonthlyMultiplier,1))","v":0},"USD",{"$f":"SUMIFS('Data Table'!J:J,'Data Table'!D:D,'Monthly Expenses'!$D6,'Data Table'!F:F,\"Outside\")*(IF(ProRateOrSum=1,MonthlyMultiplier,1))","v":0},"USD"]
[null,null,"Alcohol and Tobacco"]
[null,null,3,"Alcoholic beverages",{"$f":"SUMIFS('Data Table'!G:G,'Data Table'!D:D,'Monthly Expenses'!$D8,'Data Table'!F:F,\"Inside\",'Data Table'!H:H,LocalCurrencyCode)*(IF(ProRateOrSum=1,MonthlyMultiplier,1))","v":0},{"$f":"SUMIFS('Data Table'!J:J,'Data Table'!D:D,'Monthly Expenses'!$D8,'Data Table'!F:F,\"Inside\",'Data Table'!H:H,\"<>\"&LocalCurrencyCode)*(IF(ProRateOrSum=1,MonthlyMultiplier,1))","v":0},"USD",{"$f":"SUMIFS('Data Table'!J:J,'Data Table'!D:D,'Monthly Expenses'!$D8,'Data Table'!F:F,\"Outside\")*(IF(ProRateOrSum=1,MonthlyMultiplier,1))","v":0},"USD"]
[null,null,4,"Tobacco and tobacco products",{"$f":"SUMIFS('Data Table'!G:G,'Data Table'!D:D,'Monthly Expenses'!$D9,'Data Table'!F:F,\"Inside\",'Data Table'!H:H,LocalCurrencyCode)*(IF(ProRateOrSum=1,MonthlyMultiplier,1))","v":0},{"$f":"SUMIFS('Data Table'!J:J,'Data Table'!D:D,'Monthly Expenses'!$D9,'Data Table'!F:F,\"Inside\",'Data Table'!H:H,\"<>\"&LocalCurrencyCode)*(IF(ProRateOrSum=1,MonthlyMultiplier,1))","v":0},"USD",{"$f":"SUMIFS('Data Table'!J:J,'Data Table'!D:D,'Monthly Expenses'!$D9,'Data Table'!F:F,\"Outside\")*(IF(ProRateOrSum=1,MonthlyMultiplier,1))","v":0},"USD"]
[null,null,"Clothing and Footwear"]
[null,null,5,"Repair and cleaning of clothing",{"$f":"SUMIFS('Data Table'!G:G,'Data Table'!D:D,'Monthly Expenses'!$D11,'Data Table'!F:F,\"Inside\",'Data Table'!H:H,LocalCurrencyCode)*(IF(ProRateOrSum=1,MonthlyMultiplier,1))","v":0},{"$f":"SUMIFS('Data Table'!J:J,'Data Table'!D:D,'Monthly Expenses'!$D11,'Data Table'!F:F,\"Inside\",'Data Table'!H:H,\"<>\"&LocalCurrencyCode)*(IF(ProRateOrSum=1,MonthlyMultiplier,1))","v":0},"USD",{"$f":"SUMIFS('Data Table'!J:J,'Data Table'!D:D,'Monthly Expenses'!$D11,'Data Table'!F:F,\"Outside\")*(IF(ProRateOrSum=1,MonthlyMultiplier,1))","v":0},"USD"]
[null,null,6,"Repair of footwear",{"$f":"SUMIFS('Data Table'!G:G,'Data Table'!D:D,'Monthly Expenses'!$D12,'Data Table'!F:F,\"Inside\",'Data Table'!H:H,LocalCurrencyCode)*(IF(ProRateOrSum=1,MonthlyMultiplier,1))","v":0},{"$f":"SUMIFS('Data Table'!J:J,'Data Table'!D:D,'Monthly Expenses'!$D12,'Data Table'!F:F,\"Inside\",'Data Table'!H:H,\"<>\"&LocalCurrencyCode)*(IF(ProRateOrSum=1,MonthlyMultiplier,1))","v":0},"USD",{"$f":"SUMIFS('Data Table'!J:J,'Data Table'!D:D,'Monthly Expenses'!$D12,'Data Table'!F:F,\"Outside\")*(IF(ProRateOrSum=1,MonthlyMultiplier,1))","v":0},"USD"]
[null,null,"Furniture, Household Equipment and Home Maintenance"]
[null,null,7,"Disposable household goods",{"$f":"SUMIFS('Data Table'!G:G,'Data Table'!D:D,'Monthly Expenses'!$D14,'Data Table'!F:F,\"Inside\",'Data Table'!H:H,LocalCurrencyCode)*(IF(ProRateOrSum=1,MonthlyMultiplier,1))","v":0},{"$f":"SUMIFS('Data Table'!J:J,'Data Table'!D:D,'Monthly Expenses'!$D14,'Data Table'!F:F,\"Inside\",'Data Table'!H:H,\"<>\"&LocalCurrencyCode)*(IF(ProRateOrSum=1,MonthlyMultiplier,1))","v":0},"USD",{"$f":"SUMIFS('Data Table'!J:J,'Data Table'!D:D,'Monthly Expenses'!$D14,'Data Table'!F:F,\"Outside\")*(IF(ProRateOrSum=1,MonthlyMultiplier,1))","v":0},"USD"]
[null,null,"Health"]
{"$rows_left_out":28}
{"sheet":"Yearly and Infrequent Expenses","index":5,"n_rows":56,"n_cols":9,"rows_kept":56,"cut":false,"hidden":false,"merged":[[1,3,2,3],[3,1,52,1]]}
[]
[null,null,null,"ICSC Electronic Diary for\nYearly Expenditures","INSIDE COUNTRY\nOF DUTY STATION",null,null,"OUTSIDE COUNTRY\nOF DUTY STATION"]
[null,null,null,null,"Amount\nin Local Currency","Amount Spent in Other Currency\n(Expressed in USD)",null,"Amount Spent\n(Expressed in USD)"]
[null,"YEARLY","Clothing and Footwear"]
[null,null,29,"Men's clothing",{"$f":"SUMIFS('Data Table'!G:G,'Data Table'!D:D,'Yearly and Infrequent Expenses'!$D5,'Data Table'!F:F,\"Inside\",'Data Table'!H:H,LocalCurrencyCode)","v":0},{"$f":"SUMIFS('Data Table'!J:J,'Data Table'!D:D,'Yearly and Infrequent Expenses'!$D5,'Data Table'!F:F,\"Inside\",'Data Table'!H:H,\"<>\"&LocalCurrencyCode)","v":0},"USD",{"$f":"SUMIFS('Data Table'!J:J,'Data Table'!D:D,'Yearly and Infrequent Expenses'!$D5,'Data Table'!F:F,\"Outside\")","v":0},"USD"]
[null,null,30,"Women's clothing",{"$f":"SUMIFS('Data Table'!G:G,'Data Table'!D:D,'Yearly and Infrequent Expenses'!$D6,'Data Table'!F:F,\"Inside\",'Data Table'!H:H,LocalCurrencyCode)","v":0},{"$f":"SUMIFS('Data Table'!J:J,'Data Table'!D:D,'Yearly and Infrequent Expenses'!$D6,'Data Table'!F:F,\"Inside\",'Data Table'!H:H,\"<>\"&LocalCurrencyCode)","v":0},"USD",{"$f":"SUMIFS('Data Table'!J:J,'Data Table'!D:D,'Yearly and Infrequent Expenses'!$D6,'Data Table'!F:F,\"Outside\")","v":0},"USD"]
[null,null,31,"Boys and girls clothing",{"$f":"SUMIFS('Data Table'!G:G,'Data Table'!D:D,'Yearly and Infrequent Expenses'!$D7,'Data Table'!F:F,\"Inside\",'Data Table'!H:H,LocalCurrencyCode)","v":0},{"$f":"SUMIFS('Data Table'!J:J,'Data Table'!D:D,'Yearly and Infrequent Expenses'!$D7,'Data Table'!F:F,\"Inside\",'Data Table'!H:H,\"<>\"&LocalCurrencyCode)","v":0},"USD",{"$f":"SUMIFS('Data Table'!J:J,'Data Table'!D:D,'Yearly and Infrequent Expenses'!$D7,'Data Table'!F:F,\"Outside\")","v":0},"USD"]
[null,null,32,"Clothing accessories and materials",{"$f":"SUMIFS('Data Table'!G:G,'Data Table'!D:D,'Yearly and Infrequent Expenses'!$D8,'Data Table'!F:F,\"Inside\",'Data Table'!H:H,LocalCurrencyCode)","v":0},{"$f":"SUMIFS('Data Table'!J:J,'Data Table'!D:D,'Yearly and Infrequent Expenses'!$D8,'Data Table'!F:F,\"Inside\",'Data Table'!H:H,\"<>\"&LocalCurrencyCode)","v":0},"USD",{"$f":"SUMIFS('Data Table'!J:J,'Data Table'!D:D,'Yearly and Infrequent Expenses'!$D8,'Data Table'!F:F,\"Outside\")","v":0},"USD"]
[null,null,33,"Footwear",{"$f":"SUMIFS('Data Table'!G:G,'Data Table'!D:D,'Yearly and Infrequent Expenses'!$D9,'Data Table'!F:F,\"Inside\",'Data Table'!H:H,LocalCurrencyCode)","v":0},{"$f":"SUMIFS('Data Table'!J:J,'Data Table'!D:D,'Yearly and Infrequent Expenses'!$D9,'Data Table'!F:F,\"Inside\",'Data Table'!H:H,\"<>\"&LocalCurrencyCode)","v":0},"USD",{"$f":"SUMIFS('Data Table'!J:J,'Data Table'!D:D,'Yearly and Infrequent Expenses'!$D9,'Data Table'!F:F,\"Outside\")","v":0},"USD"]
[null,null,"Furniture, Household Equipment, Maintenance"]
[null,null,34,"Furniture, furnishings, carpets and floor coverings",{"$f":"SUMIFS('Data Table'!G:G,'Data Table'!D:D,'Yearly and Infrequent Expenses'!$D11,'Data Table'!F:F,\"Inside\",'Data Table'!H:H,LocalCurrencyCode)","v":0},{"$f":"SUMIFS('Data Table'!J:J,'Data Table'!D:D,'Yearly and Infrequent Expenses'!$D11,'Data Table'!F:F,\"Inside\",'Data Table'!H:H,\"<>\"&LocalCurrencyCode)","v":0},"USD",{"$f":"SUMIFS('Data Table'!J:J,'Data Table'!D:D,'Yearly and Infrequent Expenses'!$D11,'Data Table'!F:F,\"Outside\")","v":0},"USD"]
[null,null,35,"Households textiles, including repair",{"$f":"SUMIFS('Data Table'!G:G,'Data Table'!D:D,'Yearly and Infrequent Expenses'!$D12,'Data Table'!F:F,\"Inside\",'Data Table'!H:H,LocalCurrencyCode)","v":0},{"$f":"SUMIFS('Data Table'!J:J,'Data Table'!D:D,'Yearly and Infrequent Expenses'!$D12,'Data Table'!F:F,\"Inside\",'Data Table'!H:H,\"<>\"&LocalCurrencyCode)","v":0},"USD",{"$f":"SUMIFS('Data Table'!J:J,'Data Table'!D:D,'Yearly and Infrequent Expenses'!$D12,'Data Table'!F:F,\"Outside\")","v":0},"USD"]
[null,null,36,"Small electric household appliances",{"$f":"SUMIFS('Data Table'!G:G,'Data Table'!D:D,'Yearly and Infrequent Expenses'!$D13,'Data Table'!F:F,\"Inside\",'Data Table'!H:H,LocalCurrencyCode)","v":0},{"$f":"SUMIFS('Data Table'!J:J,'Data Table'!D:D,'Yearly and Infrequent Expenses'!$D13,'Data Table'!F:F,\"Inside\",'Data Table'!H:H,\"<>\"&LocalCurrencyCode)","v":0},"USD",{"$f":"SUMIFS('Data Table'!J:J,'Data Table'!D:D,'Yearly and Infrequent Expenses'!$D13,'Data Table'!F:F,\"Outside\")","v":0},"USD"]
[null,null,37,"Glassware, tableware and household utensils",{"$f":"SUMIFS('Data Table'!G:G,'Data Table'!D:D,'Yearly and Infrequent Expenses'!$D14,'Data Table'!F:F,\"Inside\",'Data Table'!H:H,LocalCurrencyCode)","v":0},{"$f":"SUMIFS('Data Table'!J:J,'Data Table'!D:D,'Yearly and Infrequent Expenses'!$D14,'Data Table'!F:F,\"Inside\",'Data Table'!H:H,\"<>\"&LocalCurrencyCode)","v":0},"USD",{"$f":"SUMIFS('Data Table'!J:J,'Data Table'!D:D,'Yearly and Infrequent Expenses'!$D14,'Data Table'!F:F,\"Outside\")","v":0},"USD"]
[null,null,38,"Tools, equipment and other non-durable household goods",{"$f":"SUMIFS('Data Table'!G:G,'Data Table'!D:D,'Yearly and Infrequent Expenses'!$D15,'Data Table'!F:F,\"Inside\",'Data Table'!H:H,LocalCurrencyCode)","v":0},{"$f":"SUMIFS('Data Table'!J:J,'Data Table'!D:D,'Yearly and Infrequent Expenses'!$D15,'Data Table'!F:F,\"Inside\",'Data Table'!H:H,\"<>\"&LocalCurrencyCode)","v":0},"USD",{"$f":"SUMIFS('Data Table'!J:J,'Data Table'!D:D,'Yearly and Infrequent Expenses'!$D15,'Data Table'!F:F,\"Outside\")","v":0},"USD"]
{"$rows_left_out":42}
{"sheet":"FX Rates","index":6,"n_rows":153,"n_cols":5,"rows_kept":153,"cut":false,"hidden":true,"merged":[]}
["ISO Code","15-Sep-2021 Data",null,"Duty Station",{"$f":"DSCountry","v":"Afghanistan"}]
["AFN",86.045000000000002,null,"Local Currency",{"$f":"VLOOKUP(DSCountry,CurrencyTable,3,FALSE)","v":"AFN"}]
["AED",3.673,null,"USDtoLocalMult",{"$f":"1/VLOOKUP($E$2,CurrentFXRates,2,FALSE)","v":1.1621825788831424E-2}]
["ALL",101.39]
["AMD",490.5]
["ANG",1.7669999999999999]
["AOA",643.12099999999998]
["ARS",97.710999999999999]
["AUD",1.357]
["AWG",1.79]
["AZN",1.6950000000000001]
["BAM",1.657]
["BBD",2]
["BDT",84.844999999999999]
["BGN",1.657]
{"$rows_left_out":139}
{"sheet":"Reference","index":7,"n_rows":180,"n_cols":47,"rows_kept":180,"cut":false,"hidden":true,"merged":[]}
[1,"January",null,"Afghanistan",null,"Afghanistan","Afghanistan Afghani","AFN","AFN: Afghanistan Afghani",null,"Inside",null,1,"Alcoholic Beverages and Tobacco","Alcoholic Beverages and Tobacco",null,1,"Alcohol and Tobacco","Clothing and Footwear","Communication","Education","Food and Non-Alcoholic Beverages","Furniture, Household Equipment and Home Maintenance","Health","Housing Expenditures","Miscellaneous Goods and Services","Other","Recreation and Culture","Restaurants and Hotels","Transport Purchases","Vehicles",null,1,"AFN",1,null,"Airlines","Transport Purchases","Y",null,"DATE","ITEM CATEGORY","ITEM SUBCATEGORY","ITEM DESCRIPTION","Inside/Outside\nDuty Station","AMOUNT","CURRENCY"]
[2,"February",null,"Albania",null,"Albania","Albania Lek","ALL","ALL: Albania Lek",null,"Outside",null,2,"Clothing and Footwear","Clothing and Footwear",null,2,"Alcoholic beverages","Boys and girls clothing","Postal services","Board, lodging and school meals","Food purchased in supermarkets, stores, markets","Disposable household goods","Medical, dental and paramedical services","Housing expenditures","Cosmetics and other goods for personal care","Other expenditures (Monthly)","Audio-visual equipment including repairs","Hotels, motels and camping","Airlines","Car (Net of Purchase/Sale)",null,2,"AED",2,null,"Alcoholic beverages","Alcohol and Tobacco","M"]
[3,"March",null,"Algeria",null,"Algeria","Algerian Dinar","DZD","DZD: Algerian Dinar",null,null,null,3,"Communication","Communication",null,3,"Tobacco and tobacco products","Clothing accessories and materials","Telecommunication equipment","Books and supplies","Non-alcoholic beverages","Furniture, furnishings, carpets and floor coverings","Non-prescription drugs and vitamins",null,"Electric appliances for personal care including repairs","Other expenditures (Yearly)","Books, newspapers and periodicals","Meals and beverages purchased in staff restaurants, cafeteria","Car insurance","Other vehicles (Net of Purchase/Sale): motorcycles, bicycles, etc",null,3,"ALL",3,null,"Audio-visual equipment including repairs","Recreation and Culture","Y"]
[4,"April",null,"Angola",null,"Angola","Angolan Kwanza","AOA","AOA: Angolan Kwanza",null,null,null,4,"Education","Education",null,4,null,"Footwear","Telecommunication services","Fees for extra-curricular activities, music and language (not mother tongue) classes",null,"Glassware, tableware and household utensils","Prescription drugs",null,"Financial and other services","Remittances except medical and educational expenses","Cinemas, theaters, concerts and other related activities","Meals and beverages purchased in commercial restaurants and cafes","Fuels and lubricants for personal transport",null,null,4,"AMD",4,null,"Board, lodging and school meals","Education","Y"]
[5,"May",null,"Argentina",null,"Argentina","Argentine Peso","ARS","ARS: Argentine Peso",null,null,null,5,"Food and Non-Alcoholic Beverages","Food and Non-Alcoholic Beverages",null,5,null,"Men's clothing",null,"Nursery/kindegarten costs",null,"Households textiles, including repair","Supplemental health insurance",null,"Hairdressing salons and personal grooming establishments",null,"Durable goods for indoor and outdoor recreation",null,"Local transport services",null,null,5,"ANG",5,null,"Books and supplies","Education","Y"]
[6,"June",null,"Armenia",null,"Armenia","Armenian Dram","AMD","AMD: Armenian Dram",null,null,null,6,"Furniture, Household Equipment and Home Maintenance","Furniture, Household Equipment and Routine Maintenance of the House",null,6,null,"Repair and cleaning of clothing",null,"Transportation",null,"Small electric household appliances","Therapeutic appliances and equipment, other medical supplies",null,"Other personal effects",null,"Film developing and print processing",null,"Long distance transport",null,null,6,"AOA",6,null,"Books, newspapers and periodicals","Recreation and Culture","M"]
[7,"July",null,"Australia",null,"Australia","Australian Dollar","AUD","AUD: Australian Dollar",null,null,null,7,"Health","Health",null,7,null,"Repair of footwear",null,"Tuition and enrolment fees excluding capital assessment/surcharges",null,"Tools, equipment and other non-durable household goods",null,null,"Small jewellery, clocks and watches",null,"Games, toys and hobbies",null,"Maintenance and repair of personal transport",null,null,7,"ARS",7,null,"Boys and girls clothing","Clothing and Footwear","Y"]
[8,"August",null,"Austria",null,"Austria","Euro","EUR","EUR: Euro",null,null,null,8,"Housing Expenditures","Housing Expenditures",null,8,null,"Women's clothing",null,null,null,null,null,null,"Travel goods (suitcases, bags, etc.)",null,"Gardens, plants and flowers",null,"Other services in respect of personal and public transport",null,null,8,"AUD",8,null,"Car (Net of Purchase/Sale)","Vehicles","5Y"]
[9,"September",null,"Azerbaijan",null,"Azerbaijan","Azerbaijan Manat","AZN","AZN: Azerbaijan Manat",null,null,null,9,"Miscellaneous Goods and Services","Miscellaneous Goods and Services",null,9,null,null,null,null,null,null,null,null,null,null,"Information processing equipment including repairs",null,"Spare parts and accessories for personal transport",null,null,9,"AWG",9,null,"Car insurance","Transport Purchases","M"]
[10,"October",null,"Bahamas",null,"Bahamas","Bahamian Dollar","BSD","BSD: Bahamian Dollar",null,null,null,10,"Other","Other",null,10,null,null,null,null,null,null,null,null,null,null,"Maintenance and repair for major durables for recreation, including musical instruments",null,"Taxi",null,null,10,"AZN",10,null,"Cinemas, theaters, concerts and other related activities","Recreation and Culture","M"]
[11,"November",null,"Bahrain",null,"Bahrain","Bahraini Dinar","BHD","BHD: Bahraini Dinar",null,null,null,11,"Recreation and Culture","Recreation and Culture",null,11,null,null,null,null,null,null,null,null,null,null,"Pets and related products and services",null,null,null,null,11,"BAM",11,null,"Clothing accessories and materials","Clothing and Footwear","Y"]
[12,"December",null,"Bangladesh",null,"Bangladesh","Bangladesh Taka","BDT","BDT: Bangladesh Taka",null,null,null,12,"Restaurants and Hotels","Restaurants and Hotels",null,12,null,null,null,null,null,null,null,null,null,null,"Photographic equipment and optical instruments including repairs",null,null,null,null,12,"BBD",12,null,"Cosmetics and other goods for personal care","Miscellaneous Goods and Services","M"]
[null,null,null,"Barbados",null,"Barbados","Barbados Dollar","BBD","BBD: Barbados Dollar",null,null,null,13,"Transport Purchases","Transport Purchases",null,13,null,null,null,null,null,null,null,null,null,null,"Recording media: CDs, cassettes, films",null,null,null,null,13,"BDT",13,null,"Disposable household goods","Furniture, Household Equipment and Home Maintenance","M"]
[null,null,null,"Belarus",null,"Belarus","New Belarusian Ruble","BYN","BYN: New Belarusian Ruble",null,null,null,14,"Vehicles","Personal Transport Purchases",null,14,null,null,null,null,null,null,null,null,null,null,"Small equipment for sports, camping and open air recreation",null,null,null,null,14,"BGN",14,null,"Durable goods for indoor and outdoor recreation","Recreation and Culture","Y"]
[null,null,null,"Belgium",null,"Belgium","Euro","EUR","EUR: Euro",null,null,null,null,null,null,null,null,null,null,null,null,null,null,null,null,null,null,"Sporting events and related activities",null,null,null,null,15,"BHD",15,null,"Electric appliances for personal care including repairs","Miscellaneous Goods and Services","Y"]
{"$rows_left_out":166}
{"sheet":"Temp","index":8,"n_rows":6,"n_cols":2,"rows_kept":6,"cut":false,"hidden":true,"merged":[]}
["First Day of Record",{"$f":"MIN('Data Table'!B:B)","v":"00:00:00"}]
["Last Day of Record",{"$f":"MAX('Data Table'!B:B)","v":"00:00:00"}]
["Record Span in Days",{"$f":"RecordEnd+1-RecordStart","v":1}]
["Monthly Multiplier",{"$f":"365.25/(12*RecordSpan)","v":30.4375}]
["Yearly Multiplier",{"$f":"365.25/RecordSpan","v":365.25}]
["1: Pro-rate; 2: Sum",2]