{"text_format":"1","workbook":"xlsx","n_sheets":9,"sheets":["Consignes","Saisie de dépenses","Résumé","Liste de dépenses","Dépenses mensuelles","Dépenses annuelles","Reference","FX Rates","Temp"],"not_rendered":{"charts":1,"images":0,"macros":1,"external_links":0,"defined_names":45,"comments":0,"pivot_tables":0},"unopened":[],"bounds":{"document_bytes":16777216,"sheet_cells":100000,"rows_first":2000,"rows_last":500,"rows_between":2000,"halvings":0,"cell_chars":16384,"cell_head_chars":4096},"cells_cut":0,"cells_raw":0,"read":"whole","date_system":"1900"}

{"sheet":"Consignes","index":0,"n_rows":19,"n_cols":3,"rows_kept":19,"cut":false,"hidden":false,"merged":[]}
[]
[null,null,"CFPI Journal électronique de dépenses : Consignes"]
[]
[null,null,"Bienvenue au journal électronique de dépenses de la CFPI !\nCe journal électronique est un outil facultatif pour vous aidez suivre les dépenses de votre ménage.\nMême si la fonction principale de cet outil est de vous aider à remplir l'enquête sur les dépenses de ménage administrée par la CFPI, il y a aussi des fonctions additionelles qui vous fournissent un aperçu de vos tendences de dépenses. Veuillez noter que ce journal n'est pas l'enquête réelle de la CFPI.\n\nNotez : Dans la version actuelle, les taux d'échanges utilisés correspondent à ceux fournis par le bureau de la trésorerie de l'ONU le 15 septembre 2021 (https://treasury.un.org/operationalrates/OperationalRates.php)\n\nCOMMENT UTILISER CET OUTIL :\nIl FAUT que les macros soient activées.\n\n1. Pour saisir une nouvelle dépense, soit allez à la page « Saisie de dépenses » ou cliquez sur « Ajouter une dépense ».\n2. Sur la page « Saisie de dépenses », remplissez tous les champs obligatoires et puis cliquez sur « Ajouter la dépense ».\n3. Pour réviser ou modifier l'enregistrement d'une dépenses, cliquez sur « Liste de dépenses ».\n4. Pour voir les chiffres à saisir dans l'enquête de la CFPI sur le coût de la vie, cliquez sur « Dépenses mensuelles »  et « Dépenses annuelles »."]
[]
[null,null,"La saisie de données"]
[null,null,"Vous pouvez enregistrer vos dépenses pour les différents articles du panier de biens et services de la CFPI. Ces dépenses peuvent être saisies en sélectionnant la catégorie et la sous-catégorie d'articles appropriées, et en précisant si les achats ont été effectués localement ou en dehors du pays du lieu d'affectation. L'outil vous permet de naviguer vers d'autres dates pour la saisie des données. Notez que tous les champs de saisie de données sont surlignés en jaune."]
[]
[null,null,"Le résumé"]
[null,null,"La page « Résumé »  sert de récapitulatif visuel des dépenses saisies. Toutes les valeurs affichées sur la page d'accueil sont en dollar américain (USD).\nVous pouvez accéder à d'autres fonctionnalités de ce journal à partir des boutons en bas à gauche de l'écran."]
{"$rows_left_out":10}
{"sheet":"Saisie de dépenses","index":1,"n_rows":14,"n_cols":4,"rows_kept":14,"cut":false,"hidden":false,"merged":[]}
[]
[null,"CFPI Journal électronique : Saisie de dépenses"]
[]
[null,"PAYS DE VOTRE LIEU D'AFFECTATION","Afghanistan"]
[null,null,"Date de la dépense"]
[null,null,{"$f":"TODAY()","v":"2021-10-11"}]
[]
[null,"Catégorie d'article",null,{"$f":"IF(OR(ISBLANK(NewExpenseCategory),ISERROR(MATCH(NewExpenseCategory,GroupList,0))),\"obligatoire: sélectionner de la liste déroulante\",\"\")","v":"obligatoire: sélectionner de la liste déroulante"}]
[null,"Sous-catégorie d'article",null,{"$f":"IF(OR(ISBLANK(NewExpenseSubcategory),ISERROR(MATCH(NewExpenseSubcategory,INDIRECT(CONCATENATE(LEFT(NewExpenseCategory,3),\"List\")),0))),\"obligatoire: sélectionner de la liste déroulante\",\"\")","v":"obligatoire: sélectionner de la liste déroulante"}]
[null,"Description d'article (facultatif) "," "]
{"$rows_left_out":5}
{"sheet":"Résumé","index":2,"n_rows":32,"n_cols":5,"rows_kept":32,"cut":false,"hidden":false,"merged":[[4,2,4,4],[14,2,15,4]]}
[]
[null,"CFPI Journal électronique: Résumé"]
[null,"PAYS DU LIEU D'AFFECTATION","Date"]
[null,{"$f":"DSCountry","v":"Afghanistan"},{"$f":"TODAY()","v":"2021-10-11"}]
[null,null,"Le tableau et le diagramme en camembert sont basés sur toutes les dépenses inscrites dans ce journal.\nLes taux d'échanges utilisés correspondent à ceux fournis par le bureau de la trésorerie de l'ONU le 15 septembre 2021."]
[null,"Dépenses d'aujourdhui (USD)"]
[null,{"$f":"SUMIF('Liste de dépenses'!B:B,TODAY(),'Liste de dépenses'!J:J)","v":0},null,null," "]
[]
[null,{"$f":"CONCATENATE(\"Dépenses actuelles (USD) : \",VLOOKUP(MONTH(TODAY()),MonthNumberTable,2,FALSE), \" \", YEAR(TODAY()))","v":"Dépenses actuelles (USD) : octobre 2021"}]
[null,{"$f":"SUMIF('Liste de dépenses'!B:B,\">\"&(TODAY()-DAY(TODAY())),'Liste de dépenses'!J:J)","v":0},null,null," "]
{"$rows_left_out":23}
{"sheet":"Liste de dépenses","index":3,"n_rows":106,"n_cols":27,"rows_kept":106,"cut":false,"hidden":false,"merged":[[1,6,1,9],[1,1,1,5]]}
[]
[null,"CFPI Journal électronique : Liste détaillée de toutes les dépenses",null,null,null,null,"Les taux d'échanges utilisés correspondent à ceux fournis\npar le bureau de la trésorerie de l'ONU le 15 septembre 2021"]
[null,"DATE","CATÉGORIE D'ARTICLE","SOUS-CATÉGORIE D'ARTICLE","DESCRIPTION D'ARTICLE","DANS LE / HORS DU\nLIEU D'AFFECTATION","MONTANT","DEVISE","PÉRIODE","MONTANT (USD)",null,null,null,null,null,null,null,null,null,null,null,null,null,null,null,null,"PieChart1Group"]
[]
[]
[]
[]
[]
[]
[]
{"$rows_left_out":97}
{"sheet":"Dépenses mensuelles","index":4,"n_rows":42,"n_cols":9,"rows_kept":42,"cut":false,"hidden":false,"merged":[[0,1,0,8],[1,3,2,3],[3,1,41,1]]}
[null,{"$f":"IF(ProRateOrSum=1, \"NOTE: L'exactitude des estimations au prorata dépend de la période couverte par les dépenses enregistrées. Voir \"\"Consignes\"\" pour les détails.\",\"\")","v":""}]
[null,null,null,"CFPI Journal électronique pour\nles dépenses mensuelles","À L'INTÉRIEUR\n(du pays du lieu d'affectation)",null,null,"DEHORS\n(du pays du lieu d'affectation)"]
[null,null,null,null,"Dépenses locales\nen monnaie locale","Dépenses en monnaie étrangère\n(exprimées en USD)",null,"Dépenses non locales\n(exprimées en USD)"]
[null,"DÉPENSES MENSUELLES","Produits alimentaires et boissons non alcoolisées"]
[null,null,1,"Nourriture achetée aux supermarchés, épiceries, etc",{"$f":"SUMIFS('Liste de dépenses'!G:G,'Liste de dépenses'!D:D,'Dépenses mensuelles'!$D5,'Liste de dépenses'!F:F,\"dans\",'Liste de dépenses'!H:H,LocalCurrencyCode)*(IF(ProRateOrSum=1,MonthlyMultiplier,1))","v":0},{"$f":"SUMIFS('Liste de dépenses'!J:J,'Liste de dépenses'!D:D,'Dépenses mensuelles'!$D5,'Liste de dépenses'!F:F,\"dans\",'Liste de dépenses'!H:H,\"<>\"&LocalCurrencyCode)*(IF(ProRateOrSum=1,MonthlyMultiplier,1))","v":0},"USD",{"$f":"SUMIFS('Liste de dépenses'!J:J,'Liste de dépenses'!D:D,'Dépenses mensuelles'!$D5,'Liste de dépenses'!F:F,\"hors de\")*(IF(ProRateOrSum=1,MonthlyMultiplier,1))","v":0},"USD"]
[null,null,2,"Boissons non alcoolisées",{"$f":"SUMIFS('Liste de dépenses'!G:G,'Liste de dépenses'!D:D,'Dépenses mensuelles'!$D6,'Liste de dépenses'!F:F,\"dans\",'Liste de dépenses'!H:H,LocalCurrencyCode)*(IF(ProRateOrSum=1,MonthlyMultiplier,1))","v":0},{"$f":"SUMIFS('Liste de dépenses'!J:J,'Liste de dépenses'!D:D,'Dépenses mensuelles'!$D6,'Liste de dépenses'!F:F,\"dans\",'Liste de dépenses'!H:H,\"<>\"&LocalCurrencyCode)*(IF(ProRateOrSum=1,MonthlyMultiplier,1))","v":0},"USD",{"$f":"SUMIFS('Liste de dépenses'!J:J,'Liste de dépenses'!D:D,'Dépenses mensuelles'!$D6,'Liste de dépenses'!F:F,\"hors de\")*(IF(ProRateOrSum=1,MonthlyMultiplier,1))","v":0},"USD"]
[null,null,"Boissons alcoolisées et tabacs"]
[null,null,3,"Boissons alcoolisées",{"$f":"SUMIFS('Liste de dépenses'!G:G,'Liste de dépenses'!D:D,'Dépenses mensuelles'!$D8,'Liste de dépenses'!F:F,\"dans\",'Liste de dépenses'!H:H,LocalCurrencyCode)*(IF(ProRateOrSum=1,MonthlyMultiplier,1))","v":0},{"$f":"SUMIFS('Liste de dépenses'!J:J,'Liste de dépenses'!D:D,'Dépenses mensuelles'!$D8,'Liste de dépenses'!F:F,\"dans\",'Liste de dépenses'!H:H,\"<>\"&LocalCurrencyCode)*(IF(ProRateOrSum=1,MonthlyMultiplier,1))","v":0},"USD",{"$f":"SUMIFS('Liste de dépenses'!J:J,'Liste de dépenses'!D:D,'Dépenses mensuelles'!$D8,'Liste de dépenses'!F:F,\"hors de\")*(IF(ProRateOrSum=1,MonthlyMultiplier,1))","v":0},"USD"]
[null,null,4,"Tabacs",{"$f":"SUMIFS('Liste de dépenses'!G:G,'Liste de dépenses'!D:D,'Dépenses mensuelles'!$D9,'Liste de dépenses'!F:F,\"dans\",'Liste de dépenses'!H:H,LocalCurrencyCode)*(IF(ProRateOrSum=1,MonthlyMultiplier,1))","v":0},{"$f":"SUMIFS('Liste de dépenses'!J:J,'Liste de dépenses'!D:D,'Dépenses mensuelles'!$D9,'Liste de dépenses'!F:F,\"dans\",'Liste de dépenses'!H:H,\"<>\"&LocalCurrencyCode)*(IF(ProRateOrSum=1,MonthlyMultiplier,1))","v":0},"USD",{"$f":"SUMIFS('Liste de dépenses'!J:J,'Liste de dépenses'!D:D,'Dépenses mensuelles'!$D9,'Liste de dépenses'!F:F,\"hors de\")*(IF(ProRateOrSum=1,MonthlyMultiplier,1))","v":0},"USD"]
[null,null,"Vêtements et chaussures"]
{"$rows_left_out":33}
{"sheet":"Dépenses annuelles","index":5,"n_rows":56,"n_cols":9,"rows_kept":56,"cut":false,"hidden":false,"merged":[[1,3,2,3],[3,1,52,1]]}
[]
[null,null,null,"CFPI Journal électronique pour\nles dépenses annuelles","À L'INTÉRIEUR\n(du pays du lieu d'affectation)",null,null,"DEHORS\n(du pays du lieu d'affectation)"]
[null,null,null,null,"Dépenses locales\nen monnaie locale","Dépenses en monnaie étrangère\n(exprimées en USD)",null,"Dépenses non locales\n(exprimées en USD)"]
[null,"DÉPENSES ANNUELLES","Vêtements et chaussures"]
[null,null,29,"Vêtements pour homme",{"$f":"SUMIFS('Liste de dépenses'!G:G,'Liste de dépenses'!D:D,'Dépenses annuelles'!$D5,'Liste de dépenses'!F:F,\"dans\",'Liste de dépenses'!H:H,LocalCurrencyCode)","v":0},{"$f":"SUMIFS('Liste de dépenses'!J:J,'Liste de dépenses'!D:D,'Dépenses annuelles'!$D5,'Liste de dépenses'!F:F,\"dans\",'Liste de dépenses'!H:H,\"<>\"&LocalCurrencyCode)","v":0},"USD",{"$f":"SUMIFS('Liste de dépenses'!J:J,'Liste de dépenses'!D:D,'Dépenses annuelles'!$D5,'Liste de dépenses'!F:F,\"hors de\")","v":0},"USD"]
[null,null,30,"Vêtements pour femme",{"$f":"SUMIFS('Liste de dépenses'!G:G,'Liste de dépenses'!D:D,'Dépenses annuelles'!$D6,'Liste de dépenses'!F:F,\"dans\",'Liste de dépenses'!H:H,LocalCurrencyCode)","v":0},{"$f":"SUMIFS('Liste de dépenses'!J:J,'Liste de dépenses'!D:D,'Dépenses annuelles'!$D6,'Liste de dépenses'!F:F,\"dans\",'Liste de dépenses'!H:H,\"<>\"&LocalCurrencyCode)","v":0},"USD",{"$f":"SUMIFS('Liste de dépenses'!J:J,'Liste de dépenses'!D:D,'Dépenses annuelles'!$D6,'Liste de dépenses'!F:F,\"hors de\")","v":0},"USD"]
[null,null,31,"Vêtements pour garçons et filles",{"$f":"SUMIFS('Liste de dépenses'!G:G,'Liste de dépenses'!D:D,'Dépenses annuelles'!$D7,'Liste de dépenses'!F:F,\"dans\",'Liste de dépenses'!H:H,LocalCurrencyCode)","v":0},{"$f":"SUMIFS('Liste de dépenses'!J:J,'Liste de dépenses'!D:D,'Dépenses annuelles'!$D7,'Liste de dépenses'!F:F,\"dans\",'Liste de dépenses'!H:H,\"<>\"&LocalCurrencyCode)","v":0},"USD",{"$f":"SUMIFS('Liste de dépenses'!J:J,'Liste de dépenses'!D:D,'Dépenses annuelles'!$D7,'Liste de dépenses'!F:F,\"hors de\")","v":0},"USD"]
[null,null,32,"Articles et accessoires de vêtements",{"$f":"SUMIFS('Liste de dépenses'!G:G,'Liste de dépenses'!D:D,'Dépenses annuelles'!$D8,'Liste de dépenses'!F:F,\"dans\",'Liste de dépenses'!H:H,LocalCurrencyCode)","v":0},{"$f":"SUMIFS('Liste de dépenses'!J:J,'Liste de dépenses'!D:D,'Dépenses annuelles'!$D8,'Liste de dépenses'!F:F,\"dans\",'Liste de dépenses'!H:H,\"<>\"&LocalCurrencyCode)","v":0},"USD",{"$f":"SUMIFS('Liste de dépenses'!J:J,'Liste de dépenses'!D:D,'Dépenses annuelles'!$D8,'Liste de dépenses'!F:F,\"hors de\")","v":0},"USD"]
[null,null,33,"Chaussures",{"$f":"SUMIFS('Liste de dépenses'!G:G,'Liste de dépenses'!D:D,'Dépenses annuelles'!$D9,'Liste de dépenses'!F:F,\"dans\",'Liste de dépenses'!H:H,LocalCurrencyCode)","v":0},{"$f":"SUMIFS('Liste de dépenses'!J:J,'Liste de dépenses'!D:D,'Dépenses annuelles'!$D9,'Liste de dépenses'!F:F,\"dans\",'Liste de dépenses'!H:H,\"<>\"&LocalCurrencyCode)","v":0},"USD",{"$f":"SUMIFS('Liste de dépenses'!J:J,'Liste de dépenses'!D:D,'Dépenses annuelles'!$D9,'Liste de dépenses'!F:F,\"hors de\")","v":0},"USD"]
[null,null,"Meubles, appareils ménagers et entretien courrant de la maison"]
{"$rows_left_out":47}
{"sheet":"Reference","index":6,"n_rows":180,"n_cols":47,"rows_kept":180,"cut":false,"hidden":true,"merged":[]}
[1,"janvier",null,"Afghanistan",null,"Afghanistan","Afghani","AFN","AFN :  Afghani Afghanistan",null,"dans",null,1,"Autres dépenses","Autres dépenses",null,1,"Boissons alcoolisées et tabacs","Vêtements et chaussures","Communication","Éducation","Produits alimentaires et boissons non alcoolisées","Meubles, appareils ménagers et entretien courrant de la maison","Santé","Logement et services publics","Biens et services divers","Autres dépenses","Loisirs et culture","Restaurants et hôtels","Transport","Véhicules",null,1,"AFN",1,null,"Activités extrascolaires","Éducation","Y",null,"DATE","CATÉGORIE D'ARTICLE","SOUS-CATÉGORIE D'ARTICLE","DESCRIPTION D'ARTICLE","Dans le / Hors du\nlieu d'affectation","MONTANT","DEVISE"]
[2,"février",null,"Afrique du Sud",null,"Afrique du Sud","Rand","ZAR","ZAR :  Rand Afrique du Sud",null,"hors de",null,2,"Biens et services divers","Biens et services divers",null,2,"Boissons alcoolisées","Vêtements pour garçons et filles","Services postaux","Logement, repas et cantine scolaire","Nourriture achetée aux supermarchés, épiceries, etc","Articles ménagers jetables","Services médicaux, paramédicaux et dentaires","Logement, eau, électricité, gaz, etc.","Cosmétiques et d'autres produits de soins personnels","Autres dépenses (mensuelles)","Matériel audiovisuel, y compris la réparation","Hôtels, motels et camping","Transport aérien","Voiture (solde d'achat et vente)",null,2,"AED",2,null,"Animaux de compagnie et produits et services connexes","Loisirs et culture","M"]
[3,"mars",null,"Albanie",null,"Albanie","Lek","ALL","ALL :  Lek Albanie",null,null,null,3,"Boissons alcoolisées et tabacs","Boissons alcoolisées et tabacs",null,3,"Tabacs","Articles et accessoires de vêtements","Matériel de communication","Livres et fournitures","Boissons non alcoolisées","Meubles et ameublement, tapis et autres revêtements de sol","Médicaments sans ordonnance et vitamines","Coût des employés de maison","Appareils electriques pour les soins personnels, y compris les réparations","Autres dépenses (annuelles)","Livres, journaux et périodiques","Repas et boissons achetés dans les restaurants du personnel, la cafétéria","Assurance automobile","D'autres véhicles (solde d'achat et vente): motos, scooters, vélomoteurs",null,3,"ALL",3,null,"Appareils electriques pour les soins personnels, y compris les réparations","Biens et services divers","Y"]
[4,"avril",null,"Algérie",null,"Algérie","Dinar","DZD","DZD :  Dinar Algérie",null,null,null,4,"Communication","Communications",null,4,null,"Chaussures","Services de téléphone, internet et communication","Activités extrascolaires",null,"Verrerie, vaisselle et ustensiles de ménage","Médicaments sur ordonnance",null,"Services financiers, assurances et d'autres services","Envoi de fonds à l'étranger (sauf pour l'éducation et des services médicaux)","Cinéma, théâtre, concerts et d’autres activités connexes","Repas et boissons achetés dans les restaurants et cafés commerciaux","Carburants et lubrifiants pour le transport personnel",null,null,4,"AMD",4,null,"Articles de voyage (valises, sacs, etc)","Biens et services divers","Y"]
[5,"mai",null,"Allemagne",null,"Allemagne","Euro","EUR","EUR :  Euro",null,null,null,5,"Éducation","Enseignement",null,5,null,"Vêtements pour homme",null,"Crêche",null,"Textiles ménagers, y compris la réparation","Assurance médicale additionnelle",null,"Salons de coiffure et établissements de toilettage",null,"Articles durables pour les loisirs de plein air et d'intérieur",null,"Services de transport locaux",null,null,5,"ANG",5,null,"Articles durables pour les loisirs de plein air et d'intérieur","Loisirs et culture","Y"]
[6,"juin",null,"Angola",null,"Angola","Kwanza","AOA","AOA :  Kwanza Angola",null,null,null,6,"Logement et services publics","Logement et services publics",null,6,null,"Nettoyage et réparation de vêtements",null,"Transports collectifs",null,"Petits appareils électroménagers","Matériel et appareils médicaux, autres fournitures médicales",null,"Autres effets personnels",null,"Développement de pellicules et tirage",null,"Transport longue distance",null,null,6,"AOA",6,null,"Articles et accessoires de vêtements","Vêtements et chaussures","Y"]
[7,"juillet",null,"Arabie Saoudite",null,"Arabie Saoudite","Riyal","SAR","SAR :  Riyal Arabie Saoudite",null,null,null,7,"Loisirs et culture","Loisirs et culture",null,7,null,"Réparation de chaussures",null,"Frais d'inscription et de scolarité",null,"Outils, matériel et autres articles ménagers non durables",null,null,"Petits bijoux, horloges et montres",null,"Jeux, jouets et articles de détente",null,"Entretien et réparation des moyens de transports personnels",null,null,7,"ARS",7,null,"Articles ménagers jetables","Meubles, appareils ménagers et entretien courrant de la maison","M"]
[8,"août",null,"Argentine",null,"Argentine","Peso","ARS","ARS :  Peso Argentine",null,null,null,8,"Meubles, appareils ménagers et entretien courrant de la maison","Meubles, appareils ménagers et entretien courrant de la maison",null,8,null,"Vêtements pour femme",null,null,null,null,null,null,"Articles de voyage (valises, sacs, etc)",null,"Jardins, plantes et fleurs",null,"Autres services relatifs aux transports personnels et publics",null,null,8,"AUD",8,null,"Assurance automobile","Transport","M"]
[9,"septembre",null,"Arménie",null,"Arménie","Dram","AMD","AMD :  Dram Arménie",null,null,null,9,"Produits alimentaires et boissons non alcoolisées","Produits alimentaires et boissons non alcoolisées",null,9,null,null,null,null,null,null,null,null,null,null,"Matériel informatique, y compris la réparation",null,"Pièces de rechange et accessoires pour moyens de transport personnels",null,null,9,"AWG",9,null,"Assurance médicale additionnelle","Santé","M"]
[10,"octobre",null,"Australie",null,"Australie","Dollar","AUD","AUD :  Dollar Australie",null,null,null,10,"Restaurants et hôtels","Restaurants et hôtels",null,10,null,null,null,null,null,null,null,null,null,null,"Entretien et réparation d'articles de loisirs durables incluant les instruments de musique",null,"Taxi",null,null,10,"AZN",10,null,"Autres dépenses (annuelles)","Autres dépenses","Y"]
{"$rows_left_out":171}
{"sheet":"FX Rates","index":7,"n_rows":153,"n_cols":5,"rows_kept":153,"cut":false,"hidden":true,"merged":[]}
["ISO Code","15-Sep-2021 Data",null,"Duty Station",{"$f":"DSCountry","v":"Afghanistan"}]
["AFN",86.045000000000002,null,"Local Currency",{"$f":"VLOOKUP(DSCountry,CurrencyTable,3,FALSE)","v":"AFN"}]
["AED",3.673,null,"USDtoLocalMult",{"$f":"1/VLOOKUP($E$2,CurrentFXRates,2,FALSE)","v":1.1621825788831424E-2}]
["ALL",101.39]
["AMD",490.5]
["ANG",1.7669999999999999]
["AOA",643.12099999999998]
["ARS",97.710999999999999]
["AUD",1.357]
["AWG",1.79]
{"$rows_left_out":144}
{"sheet":"Temp","index":8,"n_rows":6,"n_cols":2,"rows_kept":6,"cut":false,"hidden":true,"merged":[]}
["First Day of Record",{"$f":"MIN('Liste de dépenses'!B:B)","v":"00:00:00"}]
["Last Day of Record",{"$f":"MAX('Liste de dépenses'!B:B)","v":"00:00:00"}]
["Record Span in Days",{"$f":"RecordEnd+1-RecordStart","v":1}]
["Monthly Multiplier",{"$f":"365.25/(12*RecordSpan)","v":30.4375}]
["Yearly Multiplier",{"$f":"365.25/RecordSpan","v":365.25}]
["1: Pro-rate; 2: Sum",2]